Fixed
Status Update
Comments
yb...@google.com <yb...@google.com>
fa...@gmail.com <fa...@gmail.com> #2
Thank you for this feedback. The team may reach out for more information on triaging or reproducing this issue.
yb...@google.com <yb...@google.com>
yb...@google.com <yb...@google.com>
yb...@google.com <yb...@google.com> #3
I have tried the example project you've provided, it does not reproduce.
Could you please try running with -Pandroid.useDexArchive=false? This disables the new dexing pipeline, and fallbacks to the old one.
Could you please try running with -Pandroid.useDexArchive=false? This disables the new dexing pipeline, and fallbacks to the old one.
yb...@google.com <yb...@google.com>
sh...@google.com <sh...@google.com>
sh...@google.com <sh...@google.com> #4
@Mario Did you get a chance to try the build with -Pandroid.useDexArchive=false flag?
sh...@google.com <sh...@google.com>
yb...@google.com <yb...@google.com> #5
I'm the college of @Mario and I make it work without issues and without using -Pandroid.useDexArchive=false by using alpha6 and removing retrolambda
yb...@google.com <yb...@google.com>
va...@gmail.com <va...@gmail.com> #6
Sorry my comment from Apr 21, 2017 12:41PM was wrong.
With -Pandroid.useDexArchive=false it looks like this
:app:transformClassesWithDesugarForNonpayItalyCompatDebugAndroidTest
:app:transformClassesWithPreDexForNonpayItalyCompatDebugAndroidTest
Dex: warning: Ignoring InnerClasses attribute for an anonymous inner class
(org.ccil.cowan.tagsoup.Parser$1) that doesn't come with an
associated EnclosingMethod attribute. This class was probably produced by a
compiler that did not target the modern .class file format. The recommended
solution is to recompile the class from source, using an up-to-date compiler
and without specifying any "-target" type options. The consequence of ignoring
this warning is that reflective operations on this class will incorrectly
indicate that it is *not* an inner class.
:app:transformDexWithDexForNonpayItalyCompatDebugAndroidTest FAILED
FAILURE: Build failed with an exception.
* What went wrong:
Execution failed for task ':app:transformDexWithDexForNonpayItalyCompatDebugAndroidTest'.
> com.android.build.api.transform.TransformException: com.android.ide.common.process.ProcessException: java.util.concurrent.ExecutionException: com.android.dex.DexIndexOverflowException: method ID not in [0, 0xffff]: 65536
With -Pandroid.useDexArchive=false it looks like this
:app:transformClassesWithDesugarForNonpayItalyCompatDebugAndroidTest
:app:transformClassesWithPreDexForNonpayItalyCompatDebugAndroidTest
Dex: warning: Ignoring InnerClasses attribute for an anonymous inner class
(org.ccil.cowan.tagsoup.Parser$1) that doesn't come with an
associated EnclosingMethod attribute. This class was probably produced by a
compiler that did not target the modern .class file format. The recommended
solution is to recompile the class from source, using an up-to-date compiler
and without specifying any "-target" type options. The consequence of ignoring
this warning is that reflective operations on this class will incorrectly
indicate that it is *not* an inner class.
:app:transformDexWithDexForNonpayItalyCompatDebugAndroidTest FAILED
FAILURE: Build failed with an exception.
* What went wrong:
Execution failed for task ':app:transformDexWithDexForNonpayItalyCompatDebugAndroidTest'.
> com.android.build.api.transform.TransformException: com.android.ide.common.process.ProcessException: java.util.concurrent.ExecutionException: com.android.dex.DexIndexOverflowException: method ID not in [0, 0xffff]: 65536
ms...@gmail.com <ms...@gmail.com> #7
We updated our example repo https://github.com/originx/Gradle_troubles_android_enteprise where you can see the issue.
Just run
./gradlew spoonGermanyDebugAndroidTest
or
./gradlew spoonGermanyDebugAndroidTest -Pandroid.useDexArchive=false
and you will see the issue
Just run
./gradlew spoonGermanyDebugAndroidTest
or
./gradlew spoonGermanyDebugAndroidTest -Pandroid.useDexArchive=false
and you will see the issue
Description
Version used: 1.0.0-alpha9
Devices/Android versions reproduced on: Android 5 (it works on Android 8)
I have a strange problem connected to a MutableLiveData that doesn't trigger the observer when updated in onActivityResult. The cause seems to be a wrong state in LifecycleRegistry, in the following example the println in onResume prints "resume CREATED". Between startActivityForResult and onResume the state is set to CREATED even if the Activity remains always started (because the other activity is not full screen).
You can reproduce this issue using this Activity:
class LiveDataTestActivity : AppCompatActivity(), LifecycleRegistryOwner {
private val lifecycle = LifecycleRegistry(this)
override fun getLifecycle() = lifecycle
private val myLiveData = MutableLiveData<Int>().apply { value = 0 }
override fun onCreate(savedInstanceState: Bundle?) {
super.onCreate(savedInstanceState)
val textView = TextView(this).apply {
text = "AAAA"
setOnClickListener {
val sendIntent = Intent().apply {
action = Intent.ACTION_SEND
putExtra(Intent.EXTRA_TEXT, "This is my text to send.")
type = "text/plain"
}
startActivityForResult(sendIntent, 123)
}
}
setContentView(textView)
myLiveData.observe(this, Observer<Int> {
textView.text = it.toString()
})
}
override fun onActivityResult(requestCode: Int, resultCode: Int, data: Intent?) {
super.onActivityResult(requestCode, resultCode, data)
myLiveData.value = (myLiveData.value ?: 0) + 1
println("Value ${myLiveData.value}")
}
override fun onResume() {
super.onResume()
println("resume ${lifecycle.currentState}")
}
}